BDBM10333 4-[(2,3-dioxo-5-{[(2S)-2-(phenoxymethyl)pyrrolidine-1-]sulfonyl}-2,3-dihydro-1H-indol-1-yl)methyl]phenyl acetate::Acetic Acid (S)-4-[2,3-Dioxo-5-(2-phenoxymethyl-pyrrolidine-1-sulfonyl)-2,3-dihydroindol-1-yl-methyl]phenyl Ester::Pyrrolidine Isatin Analogue 11e
SMILES CC(=O)Oc1ccc(CN2C(=O)C(=O)c3cc(ccc23)S(=O)(=O)N2CCC[C@H]2COc2ccccc2)cc1
InChI Key InChIKey=BSDZXTVQJICEPK-NRFANRHFSA-N
Data  6 IC50
  Tab Delimited (TSV)   2D SDfile   Computed 3D by Vconf -m prep SDfile
Find this compound or compounds like it in BindingDB:
Activity Spreadsheet -- Enzyme Inhibition Constant Data from BindingDB
Found 1 hit for monomerid = 10333
TargetCaspase-6(Homo sapiens (Human))
Washington University
LigandPNGBDBM10333(4-[(2,3-dioxo-5-{[(2S)-2-(phenoxymethyl)pyrrolidin...)
Affinity DataIC50: >5.00E+3nM. Assay description: The substrate peptides terminating in AMC are processed by caspases with or without inhibitors. The amount of AMC released was determined by using a ...
In DepthDetails ArticlePubMed