BDBM103451 US8552037, 99
SMILES CC(=O)NCC[C@H]1CCc2ccc3nc(C)sc3c12
InChI Key InChIKey=JDFVYDLICOGWLH-GFCCVEGCSA-N
Data  2 IC50
  Tab Delimited (TSV)   2D SDfile   Computed 3D by Vconf -m prep SDfile
Find this compound or compounds like it in BindingDB:
Activity Spreadsheet -- Enzyme Inhibition Constant Data from BindingDB
Found 2 hits for monomerid = 103451
TargetMelatonin receptor type 1B(Homo sapiens (Human))
Takeda Pharmaceutical
US Patent
LigandPNGBDBM103451(US8552037, 99)
Affinity DataIC50:  8.5nM. Assay description: Binding assay using melatonin receptors 1 or 2.
In DepthDetails US Patent
TargetMelatonin receptor type 1A(Homo sapiens (Human))
Takeda Pharmaceutical
US Patent
LigandPNGBDBM103451(US8552037, 99)
Affinity DataIC50:  19nM. Assay description: Binding assay using melatonin receptors 1 or 2.
In DepthDetails US Patent