BDBM103453 US8552037, 107
SMILES CC(=O)NCCC1CCc2ccc3nc(oc3c12)C1CC1
InChI Key InChIKey=VHYLEDFZPNVEME-UHFFFAOYSA-N
Data  2 KI  2 IC50
  Tab Delimited (TSV)   2D SDfile   Computed 3D by Vconf -m prep SDfile
Find this compound or compounds like it in BindingDB:
Activity Spreadsheet -- Enzyme Inhibition Constant Data from BindingDB
Found 4 hits for monomerid = 103453
TargetMelatonin receptor type 1B(Homo sapiens (Human))
Takeda Pharmaceutical
Curated by ChEMBL
LigandPNGBDBM103453(US8552037, 107)
Affinity DataKi:  0.150nM. Assay description: Displacement of 2-[125l]-lodomelatonin from human MT2 expressed in CHO cell membrane incubated for 150 mins by radioligand binding assay
In DepthDetails ArticlePubMed
TargetMelatonin receptor type 1A(Homo sapiens (Human))
Takeda Pharmaceutical
Curated by ChEMBL
LigandPNGBDBM103453(US8552037, 107)
Affinity DataKi:  0.390nM. Assay description: Displacement of 2-[125l]-lodomelatonin from human MT1 expressed in CHO cell membrane incubated for 150 mins by radioligand binding assay
In DepthDetails ArticlePubMed
TargetMelatonin receptor type 1A(Homo sapiens (Human))
Takeda Pharmaceutical
Curated by ChEMBL
LigandPNGBDBM103453(US8552037, 107)
Affinity DataIC50:  0.660nM. Assay description: Binding assay using melatonin receptors 1 or 2.
In DepthDetails US Patent
TargetMelatonin receptor type 1B(Homo sapiens (Human))
Takeda Pharmaceutical
Curated by ChEMBL
LigandPNGBDBM103453(US8552037, 107)
Affinity DataIC50:  0.75nM. Assay description: Binding assay using melatonin receptors 1 or 2.
In DepthDetails US Patent