BDBM104716 US8569308, 136
SMILES Clc1cccc(c1)C(=O)Nc1cncc(Oc2cccnc2)n1
InChI Key InChIKey=CSOLVKRGZBHTRO-UHFFFAOYSA-N
Data  3 IC50
  Tab Delimited (TSV)   2D SDfile   Computed 3D by Vconf -m prep SDfile
Find this compound or compounds like it in BindingDB:
Activity Spreadsheet -- Enzyme Inhibition Constant Data from BindingDB
Found 3 hits for monomerid = 104716
TargetMetabotropic glutamate receptor 5(Homo sapiens (Human))
Vanderbilt University
US Patent
LigandPNGBDBM104716(US8569308, 136)
Affinity DataIC50:  100nM. Assay description: The mGluR5 activity was determined using the metabotropic glutamate receptor activity assays in human embryonic kidney cell.
In DepthDetails US Patent
TargetMetabotropic glutamate receptor 5(Rattus norvegicus (Rat))
Vanderbilt University Medical Center
Curated by ChEMBL
LigandPNGBDBM104716(US8569308, 136)
Affinity DataIC50:  129nM. Assay description: Negative allosteric modulator activity at rat mGlu5 expressed in HEK293A cells assessed as reduction in glutamate-induced calcium mobilization
In DepthDetails ArticlePubMed
TargetMetabotropic glutamate receptor 5(Rattus norvegicus (Rat))
Vanderbilt University Medical Center
Curated by ChEMBL
LigandPNGBDBM104716(US8569308, 136)
Affinity DataIC50:  129nM. Assay description: Negative allosteric modulator activity at rat mGlu5 expressed in HEK293A cells assessed as reduction in glutamate-induced calcium mobilization
In DepthDetails ArticlePubMed