BDBM104757 US8569308, 177
SMILES O=C(Nc1cncc(Oc2cccnc2)c1)c1cccc(c1)C#N
InChI Key InChIKey=UAVQBIRHLQKQEF-UHFFFAOYSA-N
Data  1 IC50
  Tab Delimited (TSV)   2D SDfile   Computed 3D by Vconf -m prep SDfile
Find this compound or compounds like it in BindingDB:
Activity Spreadsheet -- Enzyme Inhibition Constant Data from BindingDB
Found 1 hit for monomerid = 104757
TargetMetabotropic glutamate receptor 5(Homo sapiens (Human))
Vanderbilt University
US Patent
LigandPNGBDBM104757(US8569308, 177)
Affinity DataIC50:  500nM. Assay description: The mGluR5 activity was determined using the metabotropic glutamate receptor activity assays in human embryonic kidney cell.
In DepthDetails US Patent