BDBM104758 US8569308, 178::US8569308, 225
SMILES Clc1cccc(c1)C(=O)Nc1cncc(Oc2cncnc2)c1
InChI Key InChIKey=CHQAVODTDIEWRE-UHFFFAOYSA-N
Data  3 IC50
  Tab Delimited (TSV)   2D SDfile   Computed 3D by Vconf -m prep SDfile
Find this compound or compounds like it in BindingDB:
Activity Spreadsheet -- Enzyme Inhibition Constant Data from BindingDB
Found 3 hits for monomerid = 104758
TargetMetabotropic glutamate receptor 5(Homo sapiens (Human))
Vanderbilt University
US Patent
LigandPNGBDBM104758(US8569308, 178 | US8569308, 225)
Affinity DataIC50:  763nM. Assay description: The mGluR5 activity was determined using the metabotropic glutamate receptor activity assays in human embryonic kidney cell.
In DepthDetails US Patent
TargetMetabotropic glutamate receptor 5(Homo sapiens (Human))
Vanderbilt University
US Patent
LigandPNGBDBM104758(US8569308, 178 | US8569308, 225)
Affinity DataIC50:  471nM. Assay description: The mGluR5 activity was determined using the metabotropic glutamate receptor activity assays in human embryonic kidney cell.
In DepthDetails US Patent
TargetMetabotropic glutamate receptor 5(Rattus norvegicus (Rat))
Vanderbilt University
US Patent
LigandPNGBDBM104758(US8569308, 178 | US8569308, 225)
Affinity DataIC50:  763nM. Assay description: The mGluR5 activity was determined using the metabotropic glutamate receptor activity assays in human embryonic kidney cell.
In DepthDetails US Patent