BDBM104799 US8569308, 219
SMILES Brc1ccnc(c1)C(=O)Nc1cncc(Oc2cncnc2)c1
InChI Key InChIKey=KZNIQYFLVYURSA-UHFFFAOYSA-N
Data  1 IC50
  Tab Delimited (TSV)   2D SDfile   Computed 3D by Vconf -m prep SDfile
Find this compound or compounds like it in BindingDB:
Activity Spreadsheet -- Enzyme Inhibition Constant Data from BindingDB
Found 1 hit for monomerid = 104799
TargetMetabotropic glutamate receptor 5(Homo sapiens (Human))
Vanderbilt University
US Patent
LigandPNGBDBM104799(US8569308, 219)
Affinity DataIC50:  114nM. Assay description: The mGluR5 activity was determined using the metabotropic glutamate receptor activity assays in human embryonic kidney cell.
In DepthDetails US Patent