BDBM10517 US8846719, 302
SMILES CC(C)NC(=O)c1ccc(OCc2c(C)onc2-c2ccc(Cl)cn2)nc1
InChI Key InChIKey=JSVSQVPSMIRTCS-UHFFFAOYSA-N
Data  1 KI
  Tab Delimited (TSV)   2D SDfile   Computed 3D by Vconf -m prep SDfile
Find this compound or compounds like it in BindingDB:
Activity Spreadsheet -- Enzyme Inhibition Constant Data from BindingDB
Found 1 hit for monomerid = 10517
TargetGamma-aminobutyric acid receptor subunit alpha-5(Homo sapiens (Human))
Roche Palo Alto
US Patent
LigandPNGBDBM10517(US8846719, 302)
Affinity DataKi:  0.300nM ΔG°:  -12.1kcal/molepH: 7.5 T: 2°C. Assay description: Radioligand binding assays were carried out in a volume of 200 mL (96-well plates) which contained 100 mL of cell memebranes, [3H]flumazenil at a con...
In DepthDetails US Patent