BDBM10551 (3S)-5-(benzylsulfanyl)-3-[(2S)-2-[2-(5-bromo-2-methoxyphenyl)-2-hydroxyacetamido]-3-methylbutanamido]-4-oxopentanoic acid::valine aspartyl ketone 30
SMILES COc1ccc(Br)cc1C(O)C(=O)N[C@@H](C(C)C)C(=O)N[C@@H](CC(O)=O)C(=O)CSCc1ccccc1
InChI Key InChIKey=NKBSCZIQSOVWKJ-OSAZCDQKSA-N
Data  4 IC50
  Tab Delimited (TSV)   2D SDfile   Computed 3D by Vconf -m prep SDfile
Find this compound or compounds like it in BindingDB:
Activity Spreadsheet -- Enzyme Inhibition Constant Data from BindingDB
Found 4 hits for monomerid = 10551
TargetCaspase-3(Homo sapiens (Human))
Merck Frosst Canada
LigandPNGBDBM10551((3S)-5-(benzylsulfanyl)-3-[(2S)-2-[2-(5-bromo-2-me...)
Affinity DataIC50:  5nM. Assay description: The substrate peptides terminating in AMC are processed by caspases with or without inhibitors, and the accumulation of AMC was assessed with a Cytof...
In DepthDetails ArticlePubMed
TargetCaspase-8(Homo sapiens (Human))
Merck Frosst Canada
LigandPNGBDBM10551((3S)-5-(benzylsulfanyl)-3-[(2S)-2-[2-(5-bromo-2-me...)
Affinity DataIC50:  104nM. Assay description: The substrate peptides terminating in AMC are processed by caspases with or without inhibitors, and the accumulation of AMC was assessed with a Cytof...
In DepthDetails ArticlePubMed
TargetCaspase-7(Homo sapiens (Human))
Merck Frosst Canada
LigandPNGBDBM10551((3S)-5-(benzylsulfanyl)-3-[(2S)-2-[2-(5-bromo-2-me...)
Affinity DataIC50:  91nM. Assay description: The substrate peptides terminating in AMC are processed by caspases with or without inhibitors, and the accumulation of AMC was assessed with a Cytof...
In DepthDetails ArticlePubMed
TargetCaspase-1(Homo sapiens (Human))
Merck Frosst Canada
LigandPNGBDBM10551((3S)-5-(benzylsulfanyl)-3-[(2S)-2-[2-(5-bromo-2-me...)
Affinity DataIC50:  1.54E+3nM. Assay description: The substrate peptides terminating in AMC are processed by caspases with or without inhibitors, and the accumulation of AMC was assessed with a Cytof...
In DepthDetails ArticlePubMed