BDBM107822 US8598155, 60
SMILES CNc1ncnn2c(C)nc(-c3cnn(C)c3-c3ccc(cc3C#N)C(F)(F)F)c12
InChI Key InChIKey=XGEUSPXHEQSGNR-UHFFFAOYSA-N
Data  1 IC50
  Tab Delimited (TSV)   2D SDfile   Computed 3D by Vconf -m prep SDfile
Find this compound or compounds like it in BindingDB:
Activity Spreadsheet -- Enzyme Inhibition Constant Data from BindingDB
Found 1 hit for monomerid = 107822
TargetcGMP-dependent 3',5'-cyclic phosphodiesterase(Homo sapiens (Human))
Pfizer
US Patent
LigandPNGBDBM107822(US8598155, 60)
Affinity DataIC50:  4.28nM. Assay description: The activity of the test substances on human full-length PDE2A3 enzyme was determined using the [3H]-cGMP scintillation proximity assay (SPA) modifie...
In DepthDetails US Patent