BDBM109240 US8609710, 4
SMILES CCC1CC(C1)n1cnc(CC(CCCN)C(O)=O)c1
InChI Key InChIKey=NAMYEQZWSGWUPW-UHFFFAOYSA-N
Data  1 IC50
  Tab Delimited (TSV)   2D SDfile   Computed 3D by Vconf -m prep SDfile
Find this compound or compounds like it in BindingDB:
Activity Spreadsheet -- Enzyme Inhibition Constant Data from BindingDB
Found 1 hit for monomerid = 109240
TargetCarboxypeptidase B2(Homo sapiens (Human))
Daiichi Sankyo
US Patent
LigandPNGBDBM109240(US8609710, 4)
Affinity DataIC50:  14nM. Assay description: Enzyme inhibition assay using TAFIa.
In DepthDetails US Patent