BDBM109570 US8604061, 364
SMILES CCc1cc(Cl)ccc1[C@H]1COC(N)=N1
InChI Key InChIKey=QMJCJXYDQQSDCX-SNVBAGLBSA-N
Data  1 KI  2 EC50
  Tab Delimited (TSV)   2D SDfile   Computed 3D by Vconf -m prep SDfile
Find this compound or compounds like it in BindingDB:
Activity Spreadsheet -- Enzyme Inhibition Constant Data from BindingDB
Found 3 hits for monomerid = 109570
TargetTrace amine-associated receptor 1(Mus musculus (Mouse))
Hoffmann-La Roche
US Patent
LigandPNGBDBM109570(US8604061, 364)
Affinity DataKi:  2nM. Assay description: Radioligand binding assay using TAAR1.
In DepthDetails US Patent
TargetTrace amine-associated receptor 1(Rattus norvegicus (Rat))
Roche Innovation Center Basel
Curated by ChEMBL
LigandPNGBDBM109570(US8604061, 364)
Affinity DataEC50:  1nM. Assay description: Agonist activity at rat TAAR1 expressed in recombinant HEK293 cells assessed as cAMP accumulation after 30 mins by luminometer
In DepthDetails ArticlePubMed
TargetTrace amine-associated receptor 1(Homo sapiens (Human))
Roche Innovation Center Basel
Curated by ChEMBL
LigandPNGBDBM109570(US8604061, 364)
Affinity DataEC50:  26nM. Assay description: Agonist activity at human TAAR1 expressed in recombinant HEK293 cells assessed as cAMP accumulation after 30 mins by luminometer
In DepthDetails ArticlePubMed