BDBM112842 US8629167, 54
SMILES CCc1c(N[C@H]([C@@H](C)O)c2nnc(o2)-c2ccc(cc2)[N+]#[C-])ccc([N+]#[C-])c1Cl
InChI Key InChIKey=WSWNGIPQCGUZFW-CWTRNNRKSA-N
Data  1 IC50
  Tab Delimited (TSV)   2D SDfile   Computed 3D by Vconf -m prep SDfile
Find this compound or compounds like it in BindingDB:
Activity Spreadsheet -- Enzyme Inhibition Constant Data from BindingDB
Found 1 hit for monomerid = 112842
TargetAndrogen receptor(Rattus norvegicus (Rat))
Radius Health
US Patent
LigandPNGBDBM112842(US8629167, 54)
Affinity DataIC50:  1nM. Assay description: In order to demonstrate the utility of the compounds of this invention, an androgen receptor binding assay was performed wherein many of the compound...
In DepthDetails US Patent