BDBM112866 US8629167, 79
SMILES Cc1c(N[C@H](CCO)c2nnc(o2)-c2ccc(cc2)[N+]#[C-])ccc([N+]#[C-])c1Cl
InChI Key InChIKey=QGYNQLYJMQHUAQ-QGZVFWFLSA-N
Data  1 IC50
  Tab Delimited (TSV)   2D SDfile   Computed 3D by Vconf -m prep SDfile
Find this compound or compounds like it in BindingDB:
Activity Spreadsheet -- Enzyme Inhibition Constant Data from BindingDB
Found 1 hit for monomerid = 112866
TargetAndrogen receptor(Rattus norvegicus (Rat))
Radius Health
US Patent
LigandPNGBDBM112866(US8629167, 79)
Affinity DataIC50:  2nM. Assay description: In order to demonstrate the utility of the compounds of this invention, an androgen receptor binding assay was performed wherein many of the compound...
In DepthDetails US Patent