BDBM115144 1,3,6,7-tetrahydroxy-2-(3,4,5-trihydroxy-6-methylol-tetrahydropyran-2-yl)xanthone::1,3,6,7-tetrahydroxy-2-[3,4,5-trihydroxy-6-(hydroxymethyl)-2-oxanyl]-9-xanthenone::1,3,6,7-tetrahydroxy-2-[3,4,5-trihydroxy-6-(hydroxymethyl)oxan-2-yl]xanthen-9-one::2-[6-(hydroxymethyl)-3,4,5-tris(oxidanyl)oxan-2-yl]-1,3,6,7-tetrakis(oxidanyl)xanthen-9-one::MLS000563058::SMR001215831::cid_5358385::mangiferin
SMILES OCC1OC(C(O)C(O)C1O)c1c(O)cc2oc3cc(O)c(O)cc3c(=O)c2c1O
InChI Key InChIKey=AEDDIBAIWPIIBD-UHFFFAOYSA-N
Data  2 IC50
PDB links: 1 PDB ID matches this monomer.
  Tab Delimited (TSV)   2D SDfile   Computed 3D by Vconf -m prep SDfile
Find this compound or compounds like it in BindingDB:
Activity Spreadsheet -- Enzyme Inhibition Constant Data from BindingDB
Found 2 hits for monomerid = 115144
TargetPC4 and SFRS1-interacting protein(Homo sapiens (Human))
The Scripps Research Institute Molecular Screening Center
Curated by PubChem BioAssay
LigandPNGBDBM115144(1,3,6,7-tetrahydroxy-2-(3,4,5-trihydroxy-6-methylo...)
Affinity DataIC50:  1.74E+3nM. Assay description: Source (MLPCN Center Name): The Scripps Research Institute Molecular Screening Center (SRIMSC) Affiliation: Ohio State University Assay Provider: Mam...
In DepthDetails PCBioAssay
TargetPC4 and SFRS1-interacting protein(Homo sapiens (Human))
The Scripps Research Institute Molecular Screening Center
Curated by PubChem BioAssay
LigandPNGBDBM115144(1,3,6,7-tetrahydroxy-2-(3,4,5-trihydroxy-6-methylo...)
Affinity DataIC50:  92.3nM. Assay description: Source (MLPCN Center Name): The Scripps Research Institute Molecular Screening Center (SRIMSC) Affiliation: Ohio State University Assay Provider: Mam...
In DepthDetails PCBioAssay