BDBM11606 β-CA inhibitor, 5::4-Amino-5-bromo-3-fluorobenzenesulfonamide::4-amino-3-bromo-5-fluorobenzene-1-sulfonamide::halogenosulfanilamide deriv. 7
SMILES Nc1c(F)cc(cc1Br)S(N)(=O)=O
InChI Key InChIKey=GKYQTYGVQVABPW-UHFFFAOYSA-N
Data  7 KI
  Tab Delimited (TSV)   2D SDfile   Computed 3D by Vconf -m prep SDfile
Find this compound or compounds like it in BindingDB:
Activity Spreadsheet -- Enzyme Inhibition Constant Data from BindingDB
Found 7 hits for monomerid = 11606
TargetCarbonic anhydrase 2(Homo sapiens (Human))
University of Agricultural Sciences and Veterinary Medicine
LigandPNGBDBM11606(β-CA inhibitor, 5 | 4-Amino-5-bromo-3-fluorob...)
Affinity DataKi:  33nM. Assay description: An Applied Photophysics stopped-flow instrument has been used for assaying the CA-catalyzed CO2 hydration activity. Phenol red has been used as indic...
Ligand InfoPC cidPC sid
In DepthDetails ArticlePubMed
TargetCarbonic anhydrase 9(Homo sapiens (Human))
University of Agricultural Sciences and Veterinary Medicine
LigandPNGBDBM11606(β-CA inhibitor, 5 | 4-Amino-5-bromo-3-fluorob...)
Affinity DataKi:  69nM. Assay description: An Applied Photophysics stopped-flow instrument has been used for assaying the CA-catalyzed CO2 hydration activity. Phenol red has been used as indic...
Ligand InfoPC cidPC sid
In DepthDetails ArticlePubMed
TargetCarbonic anhydrase 4(Bos taurus (bovine))
University of Agricultural Sciences and Veterinary Medicine
LigandPNGBDBM11606(β-CA inhibitor, 5 | 4-Amino-5-bromo-3-fluorob...)
Affinity DataKi:  113nM. Assay description: An Applied Photophysics stopped-flow instrument has been used for assaying the CA-catalyzed CO2 hydration activity. Phenol red has been used as indic...
Ligand InfoPC cidPC sid
In DepthDetails ArticlePubMed
TargetBeta-carbonic anhydrase 1(Mycobacterium tuberculosis)
Universit?? Degli Studi Di Firenze
LigandPNGBDBM11606(β-CA inhibitor, 5 | 4-Amino-5-bromo-3-fluorob...)
Affinity DataKi:  940nM ΔG°:  -8.22kcal/molepH: 8.3 T: 2°C. Assay description: An Applied Photophysics stopped-flow instrument has been used for assaying the CA catalysed CO2 hydration activity [Khalifah et al., J. Biol. Chem., ...
Ligand InfoPC cidPC sid
In DepthDetails ArticlePubMed
TargetSiderophore-binding protein(Mycobacterium tuberculosis)
Universit?? Degli Studi Di Firenze
LigandPNGBDBM11606(β-CA inhibitor, 5 | 4-Amino-5-bromo-3-fluorob...)
Affinity DataKi:  3.19E+3nM ΔG°:  -7.49kcal/molepH: 8.3 T: 2°C. Assay description: An Applied Photophysics stopped-flow instrument has been used for assaying the CA catalysed CO2 hydration activity [Khalifah et al., J. Biol. Chem., ...
Ligand InfoPC cidPC sid
In DepthDetails ArticlePubMed
TargetCarbonic anhydrase 1(Homo sapiens (Human))
University of Agricultural Sciences and Veterinary Medicine
LigandPNGBDBM11606(β-CA inhibitor, 5 | 4-Amino-5-bromo-3-fluorob...)
Affinity DataKi:  3.90E+3nM. Assay description: An Applied Photophysics stopped-flow instrument has been used for assaying the CA-catalyzed CO2 hydration activity. Phenol red has been used as indic...
Ligand InfoPC cidPC sid
In DepthDetails ArticlePubMed
TargetCarbonic anhydrase 2(Mycobacterium tuberculosis)
Universit?? Degli Studi Di Firenze
LigandPNGBDBM11606(β-CA inhibitor, 5 | 4-Amino-5-bromo-3-fluorob...)
Affinity DataKi:  4.31E+3nM ΔG°:  -7.31kcal/molepH: 8.3 T: 2°C. Assay description: An Applied Photophysics stopped-flow instrument has been used for assaying the CA catalysed CO2 hydration activity [Khalifah et al., J. Biol. Chem., ...
Ligand InfoPC cidPC sid
In DepthDetails ArticlePubMed