BDBM116243 US10035794, Example 19::US10683287, Example 19::US8637508, 19
SMILES C[C@]1(CO[C@](C)(C(N)=N1)C(F)(F)F)c1cccc(NC(=O)c2ncc(cc2N)C#N)n1
InChI Key InChIKey=QLMSSDKIDFGJDT-ZWKOTPCHSA-N
Data  7 IC50
  Tab Delimited (TSV)   2D SDfile   Computed 3D by Vconf -m prep SDfile
Find this compound or compounds like it in BindingDB:
Activity Spreadsheet -- Enzyme Inhibition Constant Data from BindingDB
Found 7 hits for monomerid = 116243
TargetBeta-secretase 1(Homo sapiens (Human))
Novartis
US Patent
LigandPNGBDBM116243(US10035794, Example 19 | US10683287, Example 19 | ...)
Affinity DataIC50:  43nMpH: 4.5 T: 2°C. Assay description: Recombinant BACE-1 (extracellular domain, expressed in baculovirus and purified using standard methods) at 0.1 to 10 nM concentrations is incubated w...
In DepthDetails US Patent
TargetBeta-secretase 2(Homo sapiens (Human))
Novartis
US Patent
LigandPNGBDBM116243(US10035794, Example 19 | US10683287, Example 19 | ...)
Affinity DataIC50:  82nMpH: 4.5 T: 2°C. Assay description: Recombinant BACE-2 (extracellular domain, expressed in baculovirus and purified using standard methods) at 0.1 to 10 nM concentrations is incubated w...
In DepthDetails US Patent
TargetBeta-secretase 1(Homo sapiens (Human))
Novartis
US Patent
LigandPNGBDBM116243(US10035794, Example 19 | US10683287, Example 19 | ...)
Affinity DataIC50:  43nMpH: 4.5 T: 2°C. Assay description: Recombinant BACE-1 (extracellular domain, expressed in baculovirus and purified using standard methods) at 0.1 to 10 nM concentrations is incubated w...
In DepthDetails US Patent
TargetBeta-secretase 2(Homo sapiens (Human))
Novartis
US Patent
LigandPNGBDBM116243(US10035794, Example 19 | US10683287, Example 19 | ...)
Affinity DataIC50:  82nM. Assay description: Recombinant BACE-2 (extracellular domain, expressed in baculovirus and purified using standard methods) at 0.1 to 10 nM concentrations is incubated w...
In DepthDetails US Patent
TargetIsocitrate dehydrogenase [NADP] cytoplasmic [R132H](Homo sapiens (Human))
Novartis
US Patent
LigandPNGBDBM116243(US10035794, Example 19 | US10683287, Example 19 | ...)
Affinity DataIC50:  48nM. Assay description: Chinese hamster ovary cells are transfected with the human gene for amyloid precursor protein. The cells are plated at a density of 8000 cells/well i...
In DepthDetails US Patent
TargetBeta-secretase 1(Homo sapiens (Human))
Novartis
US Patent
LigandPNGBDBM116243(US10035794, Example 19 | US10683287, Example 19 | ...)
Affinity DataIC50:  43nM. Assay description: Recombinant BACE-1 (extracellular domain, expressed in baculovirus and purified using standard methods) at 0.1 to 10 nM concentrations is incubated w...
In DepthDetails US Patent
TargetBeta-secretase 2(Homo sapiens (Human))
Novartis
US Patent
LigandPNGBDBM116243(US10035794, Example 19 | US10683287, Example 19 | ...)
Affinity DataIC50:  82nMpH: 4.5 T: 2°C. Assay description: Recombinant BACE-2 (extracellular domain, expressed in baculovirus and purified using standard methods) at 0.1 to 10 nM concentrations is incubated w...
In DepthDetails US Patent