BDBM116266 US10035794, Example 43::US10683287, Example 43::US8637508, 43
SMILES COCCn1ccc2nc(C(=O)Nc3ccc(F)c(n3)[C@]3(C)CO[C@](C)(C(N)=N3)C(F)(F)F)c(N)nc12
InChI Key InChIKey=MMFYRHYCSIOPDG-LEWJYISDSA-N
Data  7 IC50
  Tab Delimited (TSV)   2D SDfile   Computed 3D by Vconf -m prep SDfile
Find this compound or compounds like it in BindingDB:
Activity Spreadsheet -- Enzyme Inhibition Constant Data from BindingDB
Found 7 hits for monomerid = 116266
TargetBeta-secretase 1(Homo sapiens (Human))
Novartis
US Patent
LigandPNGBDBM116266(US10035794, Example 43 | US10683287, Example 43 | ...)
Affinity DataIC50:  1.20E+3nMpH: 4.5 T: 2°C. Assay description: Recombinant BACE-1 (extracellular domain, expressed in baculovirus and purified using standard methods) at 0.1 to 10 nM concentrations is incubated w...
In DepthDetails US Patent
TargetBeta-secretase 2(Homo sapiens (Human))
Novartis
US Patent
LigandPNGBDBM116266(US10035794, Example 43 | US10683287, Example 43 | ...)
Affinity DataIC50:  1.00E+4nMpH: 4.5 T: 2°C. Assay description: Recombinant BACE-2 (extracellular domain, expressed in baculovirus and purified using standard methods) at 0.1 to 10 nM concentrations is incubated w...
In DepthDetails US Patent
TargetBeta-secretase 1(Homo sapiens (Human))
Novartis
US Patent
LigandPNGBDBM116266(US10035794, Example 43 | US10683287, Example 43 | ...)
Affinity DataIC50:  1.20E+3nMpH: 4.5 T: 2°C. Assay description: Recombinant BACE-1 (extracellular domain, expressed in baculovirus and purified using standard methods) at 0.1 to 10 nM concentrations is incubated w...
In DepthDetails US Patent
TargetBeta-secretase 2(Homo sapiens (Human))
Novartis
US Patent
LigandPNGBDBM116266(US10035794, Example 43 | US10683287, Example 43 | ...)
Affinity DataIC50: >1.00E+4nM. Assay description: Recombinant BACE-2 (extracellular domain, expressed in baculovirus and purified using standard methods) at 0.1 to 10 nM concentrations is incubated w...
In DepthDetails US Patent
TargetIsocitrate dehydrogenase [NADP] cytoplasmic [R132H](Homo sapiens (Human))
Novartis
US Patent
LigandPNGBDBM116266(US10035794, Example 43 | US10683287, Example 43 | ...)
Affinity DataIC50:  370nM. Assay description: Chinese hamster ovary cells are transfected with the human gene for amyloid precursor protein. The cells are plated at a density of 8000 cells/well i...
In DepthDetails US Patent
TargetBeta-secretase 1(Homo sapiens (Human))
Novartis
US Patent
LigandPNGBDBM116266(US10035794, Example 43 | US10683287, Example 43 | ...)
Affinity DataIC50:  1.20E+3nM. Assay description: Recombinant BACE-1 (extracellular domain, expressed in baculovirus and purified using standard methods) at 0.1 to 10 nM concentrations is incubated w...
In DepthDetails US Patent
TargetBeta-secretase 2(Homo sapiens (Human))
Novartis
US Patent
LigandPNGBDBM116266(US10035794, Example 43 | US10683287, Example 43 | ...)
Affinity DataIC50: >1.00E+4nMpH: 4.5 T: 2°C. Assay description: Recombinant BACE-2 (extracellular domain, expressed in baculovirus and purified using standard methods) at 0.1 to 10 nM concentrations is incubated w...
In DepthDetails US Patent