BDBM11963 (3R)-3-amino-4-(2,5-difluorophenyl)-1-[3-(trifluoromethyl)-1H,4H,5H,6H,7H-pyrazolo[4,3-b]pyridin-4-yl]butan-1-one::pyrazolopiperidine 65
SMILES N[C@@H](CC(=O)N1CCCc2n[nH]c(c12)C(F)(F)F)Cc1cc(F)ccc1F
InChI Key InChIKey=BTGOECKMNYMNRJ-LLVKDONJSA-N
Data  4 IC50
  Tab Delimited (TSV)   2D SDfile   Computed 3D by Vconf -m prep SDfile
Find this compound or compounds like it in BindingDB:
Activity Spreadsheet -- Enzyme Inhibition Constant Data from BindingDB
Found 4 hits for monomerid = 11963
TargetDipeptidyl peptidase 4(Homo sapiens (Human))
Merck Research Laboratories
LigandPNGBDBM11963((3R)-3-amino-4-(2,5-difluorophenyl)-1-[3-(trifluor...)
Affinity DataIC50:  590nM. Assay description: The enzyme activity resulted in the formation of the fluorescent product amidomethylcoumarin (AMC), which was monitored by excitation at 360 nm and m...
Ligand InfoPC cidPC sid
In DepthDetails ArticlePubMed
TargetDipeptidyl peptidase 9(Homo sapiens (Human))
Merck Research Laboratories
LigandPNGBDBM11963((3R)-3-amino-4-(2,5-difluorophenyl)-1-[3-(trifluor...)
Affinity DataIC50: >1.00E+5nM. Assay description: The enzyme activity resulted in the formation of the fluorescent product amidomethylcoumarin (AMC), which was monitored by excitation at 360 nm and m...
Ligand InfoPC cidPC sid
In DepthDetails ArticlePubMed
TargetDipeptidyl peptidase 8(Homo sapiens (Human))
Merck Research Laboratories
LigandPNGBDBM11963((3R)-3-amino-4-(2,5-difluorophenyl)-1-[3-(trifluor...)
Affinity DataIC50: >1.00E+5nM. Assay description: The enzyme activity resulted in the formation of the fluorescent product amidomethylcoumarin (AMC), which was monitored by excitation at 360 nm and m...
Ligand InfoPC cidPC sid
In DepthDetails ArticlePubMed
TargetDipeptidyl peptidase 2(Homo sapiens (Human))
Merck Research Laboratories
LigandPNGBDBM11963((3R)-3-amino-4-(2,5-difluorophenyl)-1-[3-(trifluor...)
Affinity DataIC50:  3.10E+4nM. Assay description: The enzyme activity resulted in the formation of the fluorescent product amidomethylcoumarin (AMC), which was monitored by excitation at 360 nm and m...
Ligand InfoPC cidPC sid
In DepthDetails ArticlePubMed