BDBM11965 (3R)-3-amino-4-(2,5-difluorophenyl)-1-[2-(trifluoromethyl)-4H,5H,6H,7H-pyrido[4,3-d][1,3]thiazol-5-yl]butan-1-one::thiazolopiperidine 67
SMILES N[C@@H](CC(=O)N1CCc2nc(sc2C1)C(F)(F)F)Cc1cc(F)ccc1F
InChI Key InChIKey=ZWPWEEACRDLJJC-LLVKDONJSA-N
Data  4 IC50
  Tab Delimited (TSV)   2D SDfile   Computed 3D by Vconf -m prep SDfile
Find this compound or compounds like it in BindingDB:
Activity Spreadsheet -- Enzyme Inhibition Constant Data from BindingDB
Found 4 hits for monomerid = 11965
TargetDipeptidyl peptidase 4(Homo sapiens (Human))
Merck Research Laboratories
LigandPNGBDBM11965((3R)-3-amino-4-(2,5-difluorophenyl)-1-[2-(trifluor...)
Affinity DataIC50:  310nM. Assay description: The enzyme activity resulted in the formation of the fluorescent product amidomethylcoumarin (AMC), which was monitored by excitation at 360 nm and m...
In DepthDetails ArticlePubMed
TargetDipeptidyl peptidase 9(Homo sapiens (Human))
Merck Research Laboratories
LigandPNGBDBM11965((3R)-3-amino-4-(2,5-difluorophenyl)-1-[2-(trifluor...)
Affinity DataIC50:  4.10E+4nM. Assay description: The enzyme activity resulted in the formation of the fluorescent product amidomethylcoumarin (AMC), which was monitored by excitation at 360 nm and m...
In DepthDetails ArticlePubMed
TargetDipeptidyl peptidase 8(Homo sapiens (Human))
Merck Research Laboratories
LigandPNGBDBM11965((3R)-3-amino-4-(2,5-difluorophenyl)-1-[2-(trifluor...)
Affinity DataIC50:  2.90E+4nM. Assay description: The enzyme activity resulted in the formation of the fluorescent product amidomethylcoumarin (AMC), which was monitored by excitation at 360 nm and m...
In DepthDetails ArticlePubMed
TargetDipeptidyl peptidase 2(Homo sapiens (Human))
Merck Research Laboratories
LigandPNGBDBM11965((3R)-3-amino-4-(2,5-difluorophenyl)-1-[2-(trifluor...)
Affinity DataIC50:  6.30E+4nM. Assay description: The enzyme activity resulted in the formation of the fluorescent product amidomethylcoumarin (AMC), which was monitored by excitation at 360 nm and m...
In DepthDetails ArticlePubMed