BDBM119869 5‐chloro‐2‐{2‐chloro‐4‐ [(phenylamino)methyl]phenoxy}phenol (26)
SMILES Oc1cc(Cl)ccc1Oc1ccc(CNc2ccccc2)cc1Cl
InChI Key InChIKey=CCVYFMASDLGDMS-UHFFFAOYSA-N
Data  1 IC50
  Tab Delimited (TSV)   2D SDfile   Computed 3D by Vconf -m prep SDfile
Find this compound or compounds like it in BindingDB:
Activity Spreadsheet -- Enzyme Inhibition Constant Data from BindingDB
Found 1 hit for monomerid = 119869
TargetEnoyl-acyl carrier reductase ENR(Toxoplasma gondii)
Johns Hopkins Bloomberg School of Public Health
LigandPNGBDBM119869(5‐chloro‐2‐{2‐chloro‐...)
Affinity DataIC50:  31nMpH: 7.5Assay Description:The reaction mixture (100 µL) contained 100 µM crotonyl-CoA, 1 µL DMSO (or compounds dissolved in DMSO), 5 nM TgENR, 100 mM sodium/pot...
In DepthDetails ArticlePubMed