BDBM121391 US8722877, 9
SMILES CN(CCCNC(=O)Nc1ccc(cc1)C(C)(C)C)CC1O[C@H]([C@H](O)[C@@H]1O)n1ccc2c(N)ncnc12
InChI Key InChIKey=SXZVJXPNQRTMDB-VIMIFYJLSA-N
Data  1 IC50
  Tab Delimited (TSV)   2D SDfile   Computed 3D by Vconf -m prep SDfile
Find this compound or compounds like it in BindingDB:
Activity Spreadsheet -- Enzyme Inhibition Constant Data from BindingDB
Found 1 hit for monomerid = 121391
TargetHistone-lysine N-methyltransferase, H3 lysine-79 specific(Homo sapiens (Human))
Epizyme
US Patent
LigandPNGBDBM121391(US8722877, 9)
Affinity DataIC50:  6nMpH: 8.0 T: 2°C. Assay description: Compound was serially diluted 3 fold in DMSO for 10 points and 1 μl was plated in a 384 well microtiter plate. Positive control (100% inhibition...
In DepthDetails US Patent