BDBM123175 US8742110, 1-24
SMILES OC(=O)c1ccc(cc1)N1CC2(CCN(Cc3cn(nc3-c3ccc(cc3)C(F)(F)F)C3CCCCC3)CC2)OC1=O
InChI Key InChIKey=CUUFGUAMONOHFX-UHFFFAOYSA-N
Data  1 IC50
  Tab Delimited (TSV)   2D SDfile   Computed 3D by Vconf -m prep SDfile
Find this compound or compounds like it in BindingDB:
Activity Spreadsheet -- Enzyme Inhibition Constant Data from BindingDB
Found 1 hit for monomerid = 123175
TargetSomatostatin receptor type 5(Homo sapiens (Human))
Merck Sharp & Dohme
US Patent
LigandPNGBDBM123175(US8742110, 1-24)
Affinity DataIC50:  2.01nMpH: 7.8Assay Description:SSTR5 binding assays can be performed by labeling somatostatin and determining the ability of a compound to inhibit somatostatin binding. (Poitout et...
In DepthDetails US Patent