BDBM123342 US8742106, 1.46
SMILES COc1cccc(c1)C(C)NC(=O)COc1cc(c2c(nn(C)c2n1)-c1ccccc1)C(F)(F)F
InChI Key InChIKey=XICVVFDXUOCBKP-UHFFFAOYSA-N
Data  2 KI  2 Kd
  Tab Delimited (TSV)   2D SDfile   Computed 3D by Vconf -m prep SDfile
Find this compound or compounds like it in BindingDB:
Activity Spreadsheet -- Enzyme Inhibition Constant Data from BindingDB
Found 4 hits for monomerid = 123342
TargetOrexin/Hypocretin receptor type 1(Homo sapiens (Human))
Novartis Institutes For Biomedical Research
Curated by ChEMBL
LigandPNGBDBM123342(US8742106, 1.46)
Affinity DataKi:  20nM. Assay description: Antagonist activity against human orexin 1 receptor after 1 hr by Ca2+ sensitive Fluo4-AM fluorescent dye-based FLIPR assay
In DepthDetails ArticlePubMed
TargetOrexin receptor type 2(Homo sapiens (Human))
Novartis Institutes For Biomedical Research
Curated by ChEMBL
LigandPNGBDBM123342(US8742106, 1.46)
Affinity DataKi:  26nM. Assay description: Antagonist activity against human orexin 2 receptor after 1 hr by Ca2+ sensitive Fluo4-AM fluorescent dye-based FLIPR assay
In DepthDetails ArticlePubMed
TargetOrexin/Hypocretin receptor type 1(Homo sapiens (Human))
Novartis Institutes For Biomedical Research
Curated by ChEMBL
LigandPNGBDBM123342(US8742106, 1.46)
Affinity DataKd:  42nMpH: 7.5 T: 2°C. Assay description: For crude cell membrane preparations, cells (CHO, Chinese hamster ovary or HEK, human embryonic kidney) expressing human orexin 1 or human orexin 2 r...
In DepthDetails US Patent
TargetOrexin receptor type 2(Homo sapiens (Human))
Novartis Institutes For Biomedical Research
Curated by ChEMBL
LigandPNGBDBM123342(US8742106, 1.46)
Affinity DataKd:  101nMpH: 7.5 T: 2°C. Assay description: For crude cell membrane preparations, cells (CHO, Chinese hamster ovary or HEK, human embryonic kidney) expressing human orexin 1 or human orexin 2 r...
In DepthDetails US Patent