BDBM12369 3-(Pyridin-3-yl)propan-1-amine::nicotine 3-heteroaromatic analogue 30
SMILES NCCCc1cccnc1
InChI Key InChIKey=CORPZWBVJRCLMW-UHFFFAOYSA-N
Data  2 KI
  Tab Delimited (TSV)   2D SDfile   Computed 3D by Vconf -m prep SDfile
Find this compound or compounds like it in BindingDB:
Activity Spreadsheet -- Enzyme Inhibition Constant Data from BindingDB
Found 2 hits for monomerid = 12369
TargetCytochrome P450 2A6(Homo sapiens (Human))
Human Biomolecular Research Institute
LigandPNGBDBM12369(3-(Pyridin-3-yl)propan-1-amine | nicotine 3-hetero...)
Affinity DataKi:  6.60E+3nM. Assay description: To measure CYP2A6 activity, coumarin 7-hydroxylation was determined. The formation of the coumarin metabolite, 7-hydroxycoumarin, was determined fluo...
In DepthDetails ArticlePubMed
TargetCytochrome P450 3A4(Homo sapiens (Human))
Human Biomolecular Research Institute
LigandPNGBDBM12369(3-(Pyridin-3-yl)propan-1-amine | nicotine 3-hetero...)
Affinity DataKi: >4.00E+5nM. Assay description: To measure CYP3A4 activity, testosterone 6-hydroxylation was determined. After reactions were terminated, the organic phase was collected and removed...
In DepthDetails ArticlePubMed