BDBM123731 2-(4-Chlorophenyl)amino-5-(1-(4-methylphenoxy)ethyl)-1,3,4-oxadiazole (3o)
SMILES CCC(Oc1ccc(Br)cc1)c1nnc(Nc2ccc(Cl)cc2)o1
InChI Key InChIKey=LPRZNPSHGSXUER-UHFFFAOYSA-N
Data  1 IC50
  Tab Delimited (TSV)   2D SDfile   Computed 3D by Vconf -m prep SDfile
Find this compound or compounds like it in BindingDB:
Activity Spreadsheet -- Enzyme Inhibition Constant Data from BindingDB
Found 1 hit for monomerid = 123731
TargetUrease [D459Y,K653P](Canavalia ensiformis (Jack bean))
Mirpur University of Science and Technology (Must)
LigandPNGBDBM123731(2-(4-Chlorophenyl)amino-5-(1-(4-methylphenoxy)ethy...)
Affinity DataIC50:  5.72E+4nMT: 2°C. Assay description: The assay mixture contained 40 uL of reaction buffer (100 mM urea, 0.01 M K2HPO4, 1 mM EDTA, and 0.01 M LiCl2, pH 8.2), 10 uL of urease (5 U/mL) and ...
In DepthDetails ArticlePubMed