BDBM123733 2-(4-Bromophenyl)amino-5-(1-(4-methylphenoxy)ethyl)-1,3,4-oxadiazole (3q)
SMILES CC(Oc1ccc(C)cc1)c1nnc(Nc2ccc(Br)cc2)o1
InChI Key InChIKey=MELHZLFWWQZYCN-UHFFFAOYSA-N
Data  1 IC50
  Tab Delimited (TSV)   2D SDfile   Computed 3D by Vconf -m prep SDfile
Find this compound or compounds like it in BindingDB:
Activity Spreadsheet -- Enzyme Inhibition Constant Data from BindingDB
Found 1 hit for monomerid = 123733
TargetUrease [D459Y,K653P](Canavalia ensiformis (Jack bean))
Mirpur University of Science and Technology (Must)
LigandPNGBDBM123733(2-(4-Bromophenyl)amino-5-(1-(4-methylphenoxy)ethyl...)
Affinity DataIC50:  3.58E+4nMT: 2°C. Assay description: The assay mixture contained 40 uL of reaction buffer (100 mM urea, 0.01 M K2HPO4, 1 mM EDTA, and 0.01 M LiCl2, pH 8.2), 10 uL of urease (5 U/mL) and ...
In DepthDetails ArticlePubMed