BDBM123822 4,5-dibromo-N'-(4-methoxybenzylidene)-1Hpyrrole-2-carbohydrazide (4i)
SMILES COc1ccc(C=NNC(=O)c2cc(Br)c(Br)[nH]2)cc1
InChI Key InChIKey=WLEIWTIUJZTGCT-FRKPEAEDSA-N
Data  2 KI
  Tab Delimited (TSV)   2D SDfile   Computed 3D by Vconf -m prep SDfile
Find this compound or compounds like it in BindingDB:
Activity Spreadsheet -- Enzyme Inhibition Constant Data from BindingDB
Found 2 hits for monomerid = 123822
TargetAmine oxidase [flavin-containing] B(Homo sapiens (Human))
University of Kwazulu-Natal
LigandPNGBDBM123822(4,5-dibromo-N'-(4-methoxybenzylidene)-1Hpyrrol...)
Affinity DataKi:  6.55E+3nM ΔG°:  -7.35kcal/molepH: 7.4 T: 2°C. Assay description: The reaction mixtures (200 uL), containing recombinant human MAO-A or MAO-B (5 ug/mL) and the test compounds in potassium phosphate buffer (100 mM; p...
In DepthDetails ArticlePubMed
TargetAmine oxidase [flavin-containing] A(Homo sapiens (Human))
University of Kwazulu-Natal
LigandPNGBDBM123822(4,5-dibromo-N'-(4-methoxybenzylidene)-1Hpyrrol...)
Affinity DataKi:  2.12E+4nM ΔG°:  -6.63kcal/molepH: 7.4 T: 2°C. Assay description: The reaction mixtures (200 uL), containing recombinant human MAO-A or MAO-B (5 ug/mL) and the test compounds in potassium phosphate buffer (100 mM; p...
In DepthDetails ArticlePubMed