BDBM123827 4,5-dibromo-N'-(4-hydroxybenzylidene)-1-methyl-1H-pyrrole-2-carbohydrazide (5d)
SMILES Cn1c(Br)c(Br)cc1C(=O)NN=Cc1ccc(O)cc1
InChI Key InChIKey=RVWFDOINLSZJDV-UHFFFAOYSA-N
Data  2 KI
  Tab Delimited (TSV)   2D SDfile   Computed 3D by Vconf -m prep SDfile
Find this compound or compounds like it in BindingDB:
Activity Spreadsheet -- Enzyme Inhibition Constant Data from BindingDB
Found 2 hits for monomerid = 123827
TargetAmine oxidase [flavin-containing] A(Homo sapiens (Human))
University of Kwazulu-Natal
LigandPNGBDBM123827(4,5-dibromo-N'-(4-hydroxybenzylidene)-1-methyl...)
Affinity DataKi:  7.10E+3nM ΔG°:  -7.30kcal/molepH: 7.4 T: 2°C. Assay description: The reaction mixtures (200 uL), containing recombinant human MAO-A or MAO-B (5 ug/mL) and the test compounds in potassium phosphate buffer (100 mM; p...
In DepthDetails ArticlePubMed
TargetAmine oxidase [flavin-containing] B(Homo sapiens (Human))
University of Kwazulu-Natal
LigandPNGBDBM123827(4,5-dibromo-N'-(4-hydroxybenzylidene)-1-methyl...)
Affinity DataKi:  1.33E+4nM ΔG°:  -6.92kcal/molepH: 7.4 T: 2°C. Assay description: The reaction mixtures (200 uL), containing recombinant human MAO-A or MAO-B (5 ug/mL) and the test compounds in potassium phosphate buffer (100 mM; p...
In DepthDetails ArticlePubMed