BDBM124112 US8754105, 25
SMILES COc1ccc2c(O[C@@H]3C[C@@H]4N(C3)C(=O)OCCCCC\C=C/[C@@H]3C[C@]3(NC4=O)C(=O)NS(=O)(=O)C3CC3)cc(nc2c1)-c1ccccc1
InChI Key InChIKey=XLMJBTKWBBMJFH-XXYXIWIZSA-N
Data  1 KI
  Tab Delimited (TSV)   2D SDfile   Computed 3D by Vconf -m prep SDfile
Find this compound or compounds like it in BindingDB:
Activity Spreadsheet -- Enzyme Inhibition Constant Data from BindingDB
Found 1 hit for monomerid = 124112
TargetGenome polyprotein(Hepatitis C virus)
Medivir
US Patent
LigandPNGBDBM124112(US8754105, 25)
Affinity DataKi:  2.40nM ΔG°:  -11.9kcal/molepH: 7.5 T: 2°C. Assay description: The aim of this in vitro assay was to measure the inhibition of HCV NS3/4A protease complexes by the compounds of the present invention. This assay p...
In DepthDetails US Patent