BDBM124456 US8759532, 118::US8759532, 154
SMILES O[C@H]1CCC[C@H](C1)c1cccnc1Oc1ccc(cc1)C(=O)c1nc2ccccc2[nH]1
InChI Key InChIKey=ULRZEXNCMHFJNG-MSOLQXFVSA-N
Data  2 IC50
  Tab Delimited (TSV)   2D SDfile   Computed 3D by Vconf -m prep SDfile
Find this compound or compounds like it in BindingDB:
Activity Spreadsheet -- Enzyme Inhibition Constant Data from BindingDB
Found 2 hits for monomerid = 124456
TargetcAMP and cAMP-inhibited cGMP 3',5'-cyclic phosphodiesterase 10A(Homo sapiens (Human))
Amgen
US Patent
LigandPNGBDBM124456(US8759532, 118 | US8759532, 154)
Affinity DataIC50:  0.547nMT: 2°C. Assay description: To check the inhibition profile, 5 μL of serial diluted compounds were incubated with 5 μL of diluted PDE10 enzyme (BPS Bioscience, San Die...
In DepthDetails US Patent
TargetcAMP and cAMP-inhibited cGMP 3',5'-cyclic phosphodiesterase 10A(Homo sapiens (Human))
Amgen
US Patent
LigandPNGBDBM124456(US8759532, 118 | US8759532, 154)
Affinity DataIC50:  0.405nMT: 2°C. Assay description: To check the inhibition profile, 5 μL of serial diluted compounds were incubated with 5 μL of diluted PDE10 enzyme (BPS Bioscience, San Die...
In DepthDetails US Patent