BDBM128802 US8802712, 60
SMILES COc1cc2ncc3n(nc(-c4ccc(cc4)C#N)c3c2cc1OC)C(C)C
InChI Key InChIKey=HYHXGRSRCUEONR-UHFFFAOYSA-N
Data  1 IC50
  Tab Delimited (TSV)   2D SDfile   Computed 3D by Vconf -m prep SDfile
Find this compound or compounds like it in BindingDB:
Activity Spreadsheet -- Enzyme Inhibition Constant Data from BindingDB
Found 1 hit for monomerid = 128802
TargetDNA-dependent protein kinase catalytic subunit(Homo sapiens (Human))
Merck Patent
US Patent
LigandPNGBDBM128802(US8802712, 60)
Affinity DataIC50:  0.300nMpH: 7.4 T: 2°C. Assay description: The kinase assay was carried out in streptavidin-coated 348-well microtitre FlashPlates®. To this end, 1.5 μg of the DNA-PK/protein complex and ...
In DepthDetails US Patent