BDBM129333 US8815951, Epoxide Hydrolase Inhibitor 14
SMILES Cc1cccc(c1)C(=O)C1OC1c1ccc(cc1)-c1ccccc1
InChI Key InChIKey=UCDRONQWQOCONA-UHFFFAOYSA-N
Data  2 IC50
  Tab Delimited (TSV)   2D SDfile   Computed 3D by Vconf -m prep SDfile
Find this compound or compounds like it in BindingDB:
Activity Spreadsheet -- Enzyme Inhibition Constant Data from BindingDB
Found 2 hits for monomerid = 129333
TargetEpoxide hydrolase 1(Homo sapiens (Human))
The Regents of The University of California
US Patent
LigandPNGBDBM129333(US8815951, Epoxide Hydrolase Inhibitor 14)
Affinity DataIC50:  190nM. Assay description: The invention also provide methods for assaying for epoxide hydrolase activity as diagnostic assay to identify individuals at increased risk for hype...
In DepthDetails US Patent
TargetEpoxide hydrolase 1(Mus musculus (Mouse))
The Regents of The University of California
US Patent
LigandPNGBDBM129333(US8815951, Epoxide Hydrolase Inhibitor 14)
Affinity DataIC50:  100nM. Assay description: The invention also provide methods for assaying for epoxide hydrolase activity as diagnostic assay to identify individuals at increased risk for hype...
In DepthDetails US Patent