BDBM129368 US8802673, 10
SMILES Brc1ccc(Nc2ccc(cc2)[C@H]2CNCCO2)nc1
InChI Key InChIKey=AQHSBQXKHQIYAO-CQSZACIVSA-N
Data  2 KI
  Tab Delimited (TSV)   2D SDfile   Computed 3D by Vconf -m prep SDfile
Find this compound or compounds like it in BindingDB:
Activity Spreadsheet -- Enzyme Inhibition Constant Data from BindingDB
Found 2 hits for monomerid = 129368
TargetTrace amine-associated receptor 1(Mus musculus (Mouse))
Hoffmann-La Roche
US Patent
LigandPNGBDBM129368(US8802673, 10)
Affinity DataKi:  1.5nM ΔG°:  -12.5kcal/molepH: 7.4 T: 2°C. Assay description: HEK-293 cells stably expressing rat TAAR1 were maintained at 37 C. and 5% CO2 in DMEM high glucose medium, containing fetal calf serum (10%, heat ina...
In DepthDetails US Patent
TargetTrace amine-associated receptor 7b(Rattus norvegicus (Rat))
Hoffmann-La Roche
US Patent
LigandPNGBDBM129368(US8802673, 10)
Affinity DataKi:  33.7nM ΔG°:  -10.6kcal/molepH: 7.4 T: 2°C. Assay description: HEK-293 cells stably expressing mouse TAAR1 were maintained at 37 C. and 5% CO2 in DMEM high glucose medium, containing fetal calf serum (10%, heat i...
In DepthDetails US Patent