BDBM130199 US8815881, 161
SMILES CN1C(N)=N[C@](C)(c2cc(Nc3ccc(cc3OC(F)(F)F)C#N)ccc2F)C(C)(C)C1=O
InChI Key InChIKey=LVOJRTFUMCPUIR-OAQYLSRUSA-N
Data  1 IC50
  Tab Delimited (TSV)   2D SDfile   Computed 3D by Vconf -m prep SDfile
Find this compound or compounds like it in BindingDB:
Activity Spreadsheet -- Enzyme Inhibition Constant Data from BindingDB
Found 1 hit for monomerid = 130199
TargetBeta-secretase 2(Homo sapiens (Human))
Hoffmann-La Roche
US Patent
LigandPNGBDBM130199(US8815881, 161)
Affinity DataIC50:  13nMT: 2°C. Assay description: BACE2 enzyme ectodomain (derived from plasmid pET17b-T7-hu proBACE2) was prepared as described in Ostermann et al., Crystal Structure of Human BACE2 ...
In DepthDetails US Patent