BDBM13093 2-{[4-(2-ethoxyethoxy)benzene](2-methylpropyl)sulfonamido}-N-hydroxyacetamide::CGS 27023A Analog 21
SMILES CCOCCOc1ccc(cc1)S(=O)(=O)N(CC(C)C)CC(=O)NO
InChI Key InChIKey=KPHZILOOIGLYMY-UHFFFAOYSA-N
Data  2 KI
  Tab Delimited (TSV)   2D SDfile   Computed 3D by Vconf -m prep SDfile
Find this compound or compounds like it in BindingDB:
Activity Spreadsheet -- Enzyme Inhibition Constant Data from BindingDB
Found 2 hits for monomerid = 13093
TargetStromelysin-1(Homo sapiens (Human))
Pomona College
Curated by ChEMBL
LigandPNGBDBM13093(2-{[4-(2-ethoxyethoxy)benzene](2-methylpropyl)sulf...)
Affinity DataKi:  1.12E+3nM. Assay description: Inhibition of human recombinant MMP3
In DepthDetails ArticlePubMed
TargetStromelysin-1(Homo sapiens (Human))
Pomona College
Curated by ChEMBL
LigandPNGBDBM13093(2-{[4-(2-ethoxyethoxy)benzene](2-methylpropyl)sulf...)
Affinity DataKi:  1.13E+3nM ΔG°:  -8.43kcal/molepH: 7.5 T: 2°C. Assay description: Stromelysin inhibitory activity is based on the hydrolysis of substance P by recombinant human stromelysin to generate a fragment, substance P 7-11, ...
In DepthDetails ArticlePubMed