BDBM131744 US8829193, 18
SMILES NC1CN(CCC1Cl)c1ccncc1NC(=O)c1csc(n1)-c1c(F)cccc1F
InChI Key InChIKey=IVDRVWFOHOJDBW-UHFFFAOYSA-N
Data  3 IC50
  Tab Delimited (TSV)   2D SDfile   Computed 3D by Vconf -m prep SDfile
Find this compound or compounds like it in BindingDB:
Activity Spreadsheet -- Enzyme Inhibition Constant Data from BindingDB
Found 3 hits for monomerid = 131744
TargetSerine/threonine-protein kinase pim-1(Homo sapiens (Human))
Novartis
US Patent
LigandPNGBDBM131744(US8829193, 18)
Affinity DataIC50:  5nMpH: 7.5Assay Description:The activity of PIM1 is measured using a luciferase-luciferin based ATP detection reagent to quantify ATP depletion resulting from kinase-catalyzed p...
In DepthDetails US Patent
TargetSerine/threonine-protein kinase pim-3(Homo sapiens (Human))
Novartis
US Patent
LigandPNGBDBM131744(US8829193, 18)
Affinity DataIC50:  12nMpH: 7.5Assay Description:The activity of PIM3 is measured using a luciferase-luciferin based ATP detection reagent to quantify ATP depletion resulting from kinase-catalyzed p...
In DepthDetails US Patent
TargetSerine/threonine-protein kinase pim-2(Homo sapiens (Human))
Novartis
US Patent
LigandPNGBDBM131744(US8829193, 18)
Affinity DataIC50:  54nMpH: 7.5Assay Description:The activity of PIM2 is measured using a luciferase-luciferin based ATP detection reagent to quantify ATP depletion resulting from kinase-catalyzed p...
In DepthDetails US Patent