BDBM13250 2-N-benzene-5-N-(2-chloro-6-methylphenyl)-1,3-thiazole-2,5-diamido::BMS-354825 2-Carboxamido-4-hydrido-thiazole Analog 7r::CHEMBL131393::N-(2-Chloro-6-methylphenyl)-2-[(phenylcarbonyl)amino]-1,3-thiazole-5-carboxamide
SMILES Cc1cccc(Cl)c1NC(=O)c1cnc(NC(=O)c2ccccc2)s1
InChI Key InChIKey=GGCYNGKPFFUEPC-UHFFFAOYSA-N
Data  3 IC50
  Tab Delimited (TSV)   2D SDfile   Computed 3D by Vconf -m prep SDfile
Find this compound or compounds like it in BindingDB:
Activity Spreadsheet -- Enzyme Inhibition Constant Data from BindingDB
Found 3 hits for monomerid = 13250
TargetTyrosine-protein kinase Lck(Homo sapiens (Human))
Bristol-Myers Squibb
LigandPNGBDBM13250(2-N-benzene-5-N-(2-chloro-6-methylphenyl)-1,3-thia...)
Affinity DataIC50:  890nM. Assay description: IC50 is the inhibitor concentration, which inhibits 50% of kinase activity that catalyzes the transfer of the terminal phosphate from [gamma-33P] lab...
In DepthDetails ArticlePubMed
TargetTyrosine-protein kinase Lck(Homo sapiens (Human))
Bristol-Myers Squibb
LigandPNGBDBM13250(2-N-benzene-5-N-(2-chloro-6-methylphenyl)-1,3-thia...)
Affinity DataIC50:  890nM. Assay description: Inhibition of human Lck
In DepthDetails ArticlePubMed
TargetTyrosine-protein kinase Lck(Homo sapiens (Human))
Bristol-Myers Squibb
LigandPNGBDBM13250(2-N-benzene-5-N-(2-chloro-6-methylphenyl)-1,3-thia...)
Affinity DataIC50:  890nM. Assay description: Inhibitory activity of the compound human Lck(hLck) kinase
In DepthDetails ArticlePubMed