BDBM133433 US8846719, 119
SMILES CC(C)NC(=O)c1ccc(OCc2c(C)onc2-c2ccc(Cl)cc2)nc1
InChI Key InChIKey=QXXHRDARSLCBQO-UHFFFAOYSA-N
Data  1 KI
  Tab Delimited (TSV)   2D SDfile   Computed 3D by Vconf -m prep SDfile
Find this compound or compounds like it in BindingDB:
Activity Spreadsheet -- Enzyme Inhibition Constant Data from BindingDB
Found 1 hit for monomerid = 133433
TargetGamma-aminobutyric acid receptor subunit alpha-5(Homo sapiens (Human))
Roche Palo Alto
US Patent
LigandPNGBDBM133433(US8846719, 119)
Affinity DataKi:  0.700nM ΔG°:  -11.6kcal/molepH: 7.5 T: 2°C. Assay description: Radioligand binding assays were carried out in a volume of 200 mL (96-well plates) which contained 100 mL of cell memebranes, [3H]flumazenil at a con...
In DepthDetails US Patent