BDBM136744 US8865911, 20g Isomer 1
SMILES CO[C@H]1CC[C@@]2(Cc3ccc(cc3[C@@]22N=C(C)C(N)=N2)-c2ccc(F)c(c2)C#N)CC1
InChI Key InChIKey=GJVWSAKHBXGRHV-OPXMRZJTSA-N
Data  1 IC50
  Tab Delimited (TSV)   2D SDfile   Computed 3D by Vconf -m prep SDfile
Find this compound or compounds like it in BindingDB:
Activity Spreadsheet -- Enzyme Inhibition Constant Data from BindingDB
Found 1 hit for monomerid = 136744
TargetBeta-secretase 1(Homo sapiens (Human))
Astrazeneca
US Patent
LigandPNGBDBM136744(US8865911, 20g Isomer 1)
Affinity DataIC50:  2.5nMpH: 9.2Assay Description:TR-FRET AssayThe beta-secretase enzyme used in the TR-FRET is prepared as follows: The cDNA for the soluble part of the human beta-Secretase (AA 1-AA...
In DepthDetails US Patent