BDBM136788 US10231967, Example 30d::US8865911, 30d::US9918985, Example 30d
SMILES COC1CCC2(CC1)Oc1ccc(cc1C21N=C(C)C(N)=N1)-c1cncc(Cl)c1
InChI Key InChIKey=RVZQCFAUGDSGAA-UHFFFAOYSA-N
Data  4 IC50
  Tab Delimited (TSV)   2D SDfile   Computed 3D by Vconf -m prep SDfile
Find this compound or compounds like it in BindingDB:
Activity Spreadsheet -- Enzyme Inhibition Constant Data from BindingDB
Found 4 hits for monomerid = 136788
TargetBeta-secretase 1(Homo sapiens (Human))
Astrazeneca
US Patent
LigandPNGBDBM136788(US10231967, Example 30d | US8865911, 30d | US99189...)
Affinity DataIC50:  5.20nMpH: 9.2Assay Description:TR-FRET AssayThe beta-secretase enzyme used in the TR-FRET is prepared as follows: The cDNA for the soluble part of the human beta-Secretase (AA 1-AA...
In DepthDetails US Patent
TargetBeta-secretase 1 [1-460](Homo sapiens (Human))
Astrazeneca
US Patent
LigandPNGBDBM136788(US10231967, Example 30d | US8865911, 30d | US99189...)
Affinity DataIC50:  5.20nM. Assay description: The enzyme (truncated form) was diluted to 6 μg/mL (stock 1.3 mg/mL) and the substrate (Europium)CEVNLDAEFK(Qsy7) to 200 nM (stock 120 μM) ...
In DepthDetails US Patent
TargetAmyloid-beta precursor protein(Homo sapiens (Human))
Astrazeneca
US Patent
LigandPNGBDBM136788(US10231967, Example 30d | US8865911, 30d | US99189...)
Affinity DataIC50:  97nM. Assay description: SH-SY5Y cells were cultured in DMEM/F-12 with Glutamax, 10% FCS and 1% non-essential amino acids and cryopreserved and stored at −140° C. at a ...
In DepthDetails US Patent
TargetAmyloid-beta precursor protein(Homo sapiens (Human))
Astrazeneca
US Patent
LigandPNGBDBM136788(US10231967, Example 30d | US8865911, 30d | US99189...)
Affinity DataIC50:  5.20nM. Assay description: The β-secretase enzyme used in the TR-FRET is prepared as follows: The cDNA for the soluble part of the human β-Secretase (AA 1-AA 460) was...
In DepthDetails US Patent