BDBM137272 US8871790, 352
SMILES CC(C)CNC(=O)Nc1cc(ccc1C)C(=O)N1CCC2(CC1)OCc1cc(ccc21)C#N
InChI Key InChIKey=XSGLHMQYVARERM-UHFFFAOYSA-N
Data  1 IC50
  Tab Delimited (TSV)   2D SDfile   Computed 3D by Vconf -m prep SDfile
Find this compound or compounds like it in BindingDB:
Activity Spreadsheet -- Enzyme Inhibition Constant Data from BindingDB
Found 1 hit for monomerid = 137272
TargetFatty acid synthase(Homo sapiens (Human))
3-V Biosciences
US Patent
LigandPNGBDBM137272(US8871790, 352)
Affinity DataIC50:  880nM. Assay description: The FASN enzyme was isolated from SKBr3 cells. SKBr3 is a human breast cancer cell-line with high levels of FASN expression. It is estimated that FAS...
In DepthDetails US Patent