BDBM138155 US8877798, Table 3, Structure 1
SMILES CN1CC2C[C@]2(C1)c1ccc(Cl)c(Cl)c1
InChI Key InChIKey=MBFDPIYMOIZLLZ-ACGXKRRESA-N
Data  3 KI
  Tab Delimited (TSV)   2D SDfile   Computed 3D by Vconf -m prep SDfile
Find this compound or compounds like it in BindingDB:
Activity Spreadsheet -- Enzyme Inhibition Constant Data from BindingDB
Found 3 hits for monomerid = 138155
TargetSodium-dependent serotonin transporter(Rattus norvegicus (rat))
Neurovance
US Patent
LigandPNGBDBM138155(US8877798, Table 3, Structure 1)
Affinity DataKi:  16nM. Assay description: Binding assay using NET, DAT and SERT enzyme.
In DepthDetails US Patent
TargetTransporter(Rattus norvegicus (rat))
Neurovance
US Patent
LigandPNGBDBM138155(US8877798, Table 3, Structure 1)
Affinity DataKi:  81nM. Assay description: Binding assay using NET, DAT and SERT enzyme.
In DepthDetails US Patent
TargetSodium-dependent dopamine transporter(Rattus norvegicus (rat))
Neurovance
US Patent
LigandPNGBDBM138155(US8877798, Table 3, Structure 1)
Affinity DataKi:  105nM. Assay description: Binding assay using NET, DAT and SERT enzyme.
In DepthDetails US Patent