BDBM14023 (1R,2R,5R)-30-oxo-19-oxa-2,6,10,12-tetraazahexacyclo[18.6.2.1^{2,5}.1^{14,18}.0^{8,12}.0^{23,27}]triaconta-8,10,14(29),15,17,20(28),21,23(27)-octaene-17-carbonitrile::Macrocyclic 3-Aminopyrrolidinone analog 83
SMILES O=C1[C@H]2CCN1[C@@H]1CCCc3ccc(Oc4cc(Cn5cncc5CN2)ccc4C#N)cc13
InChI Key InChIKey=VWNBOOIWICWEPL-DNQXCXABSA-N
Data  5 IC50
  Tab Delimited (TSV)   2D SDfile   Computed 3D by Vconf -m prep SDfile
Find this compound or compounds like it in BindingDB:
Activity Spreadsheet -- Enzyme Inhibition Constant Data from BindingDB
Found 5 hits for monomerid = 14023
LigandPNGBDBM14023((1R,2R,5R)-30-oxo-19-oxa-2,6,10,12-tetraazahexacyc...)
Affinity DataIC50: <1nM. Assay description: Compounds were tested as inhibitors of FTase in vitro using purified recombinant human enzyme to catalyze the reaction between [3H]FPP and a recombin...
In DepthDetails ArticlePubMed
LigandPNGBDBM14023((1R,2R,5R)-30-oxo-19-oxa-2,6,10,12-tetraazahexacyc...)
Affinity DataIC50:  390nM. Assay description: The enzymatic reaction between [3H]GGPP and a biotinylated peptide was carried out in the presence of 5 mM ATP and varying concentrations of inhibit...
In DepthDetails ArticlePubMed
LigandPNGBDBM14023((1R,2R,5R)-30-oxo-19-oxa-2,6,10,12-tetraazahexacyc...)
Affinity DataIC50:  0.0200nM. Assay description: Inhibition of human recombinant FTase using [3H]farnesyldiphosphate
In DepthDetails ArticlePubMed
TargetPotassium voltage-gated channel subfamily H member 2(Homo sapiens (Human))
Astrazeneca
Curated by ChEMBL
LigandPNGBDBM14023((1R,2R,5R)-30-oxo-19-oxa-2,6,10,12-tetraazahexacyc...)
Affinity DataIC50:  1.20E+4nM. Assay description: Inhibition of human ERG channel
In DepthDetails ArticlePubMed
TargetPotassium voltage-gated channel subfamily H member 2(Homo sapiens (Human))
Astrazeneca
Curated by ChEMBL
LigandPNGBDBM14023((1R,2R,5R)-30-oxo-19-oxa-2,6,10,12-tetraazahexacyc...)
Affinity DataIC50:  7.00E+3nM. Assay description: Inhibition of human ERG channel
In DepthDetails ArticlePubMed