BDBM14114 (2S)-N-[5-carbamimidamido-1-(1-methyl-1H-1,3-benzodiazol-2-yl)-1-oxopentan-2-yl]-1-[(2R)-2-(methylamino)-3-phenylpropanoyl]pyrrolidine-2-carboxamide::2-ketobenzothiazole 54
SMILES [#6]-[#7]-[#6@H](-[#6]-c1ccccc1)-[#6](=O)-[#7]-1-[#6]-[#6]-[#6]-[#6@H]-1-[#6](=O)-[#7]-[#6](-[#6]-[#6]-[#6]\[#7]=[#6](/[#7])-[#7])-[#6](=O)-c1nc2ccccc2n1-[#6]
InChI Key InChIKey=QMYCSIPHSWKVGL-MKXPUETBSA-N
Data  2 KI  1 IC50
  Tab Delimited (TSV)   2D SDfile   Computed 3D by Vconf -m prep SDfile
Find this compound or compounds like it in BindingDB:
Activity Spreadsheet -- Enzyme Inhibition Constant Data from BindingDB
Found 2 hits for monomerid = 14114
TargetProthrombin(Homo sapiens (Human))
Johnson & Johnson Pharmaceutical
LigandPNGBDBM14114((2S)-N-[5-carbamimidamido-1-(1-methyl-1H-1,3-benzo...)
Affinity DataKi:  8.10nM IC50:  110nM. Assay description: Thrombin-catalyzed hydrolysis rates were measured spectrophotometrically using human alpha-thrombin, a chromogenic substrate in aqueous buffer, and a...
In DepthDetails ArticlePubMed
TargetSerine protease 1(Bos taurus (bovine))
Johnson & Johnson Pharmaceutical
LigandPNGBDBM14114((2S)-N-[5-carbamimidamido-1-(1-methyl-1H-1,3-benzo...)
Affinity DataKi:  290nM. Assay description: Trypsin-catalyzed hydrolysis rates were measured spectrophotometrically using bovine trypsin, a chromogenic substrate in aqueous buffer, and a microp...
In DepthDetails ArticlePubMed