BDBM141151 US8653100, 74
SMILES CCCS(=O)(=O)NCCOc1ccc2CCN(N=O)C(c2c1)C1(CCC1)c1ccc(F)cc1
InChI Key InChIKey=VZGOWKZLCTUZQY-UHFFFAOYSA-N
Data  1 IC50
  Tab Delimited (TSV)   2D SDfile   Computed 3D by Vconf -m prep SDfile
Find this compound or compounds like it in BindingDB:
Activity Spreadsheet -- Enzyme Inhibition Constant Data from BindingDB
Found 1 hit for monomerid = 141151
TargetSodium- and chloride-dependent glycine transporter 1(Homo sapiens (Human))
Abbvie
US Patent
LigandPNGBDBM141151(US8653100, 74)
Affinity DataIC50: <1.00E+4nM. Assay description: [3H]-Glycine uptake into recombinant CHO cells expressing human GlyT1: Human GlyT1c expressing recombinant hGlyT1c_5_CHO cells were plated at 20,000 ...
In DepthDetails US Patent