BDBM141227 US9682141, 542
SMILES Nc1nc2cc(ccc2o1)-c1ccc2ncc(nc2n1)N1CCC(F)(F)CC1
InChI Key InChIKey=LVARWLPSVNIHCU-UHFFFAOYSA-N
Data  4 IC50
  Tab Delimited (TSV)   2D SDfile   Computed 3D by Vconf -m prep SDfile
Find this compound or compounds like it in BindingDB:
Activity Spreadsheet -- Enzyme Inhibition Constant Data from BindingDB
Found 4 hits for monomerid = 141227
TargetPhosphatidylinositol 3-kinase regulatory subunit alpha(Homo sapiens (Human))
Intellikine
US Patent
LigandPNGBDBM141227(US9682141, 542)
Affinity DataIC50: <100nMT: 2°C. Assay description: Briefly, the assay is a time resolved FRET assay that indirectly measures PIP3 product formed by the activity of a PI3-K. The kinase reaction is perf...
Ligand InfoPC cidPC sid
In DepthDetails US Patent
LigandPNGBDBM141227(US9682141, 542)
Affinity DataIC50: <100nMT: 2°C. Assay description: Briefly, the assay is a time resolved FRET assay that indirectly measures PIP3 product formed by the activity of a PI3-K. The kinase reaction is perf...
Ligand InfoPC cidPC sid
In DepthDetails US Patent
LigandPNGBDBM141227(US9682141, 542)
Affinity DataIC50: >1.00E+4nMT: 2°C. Assay description: Briefly, the assay is a time resolved FRET assay that indirectly measures PIP3 product formed by the activity of a PI3-K. The kinase reaction is perf...
Ligand InfoPC cidPC sid
In DepthDetails US Patent
TargetPhosphatidylinositol 3-kinase regulatory subunit beta(Homo sapiens (Human))
Intellikine
US Patent
LigandPNGBDBM141227(US9682141, 542)
Affinity DataIC50: >1.00E+4nMT: 2°C. Assay description: Briefly, the assay is a time resolved FRET assay that indirectly measures PIP3 product formed by the activity of a PI3-K. The kinase reaction is perf...
Ligand InfoPC cidPC sid
In DepthDetails US Patent