BDBM142837 US8940736, 409
SMILES Clc1c(NC2CCN(CC2)C2COC2)cc(cc1Nc1nc(NC2CC2)c2ncc(C#N)n2n1)C#N
InChI Key InChIKey=DCAIOCXHNAGAPE-UHFFFAOYSA-N
Data  2 IC50
  Tab Delimited (TSV)   2D SDfile   Computed 3D by Vconf -m prep SDfile
Find this compound or compounds like it in BindingDB:
Activity Spreadsheet -- Enzyme Inhibition Constant Data from BindingDB
Found 2 hits for monomerid = 142837
TargetCasein kinase II subunit alpha'(Homo sapiens (Human))
Bristol-Myers Squibb
US Patent
LigandPNGBDBM142837(US8940736, 409)
Affinity DataIC50:  0.820nMpH: 7.4 T: 2°C. Assay description: The effectiveness of compounds of the present invention as inhibitors of protein kinases can be readily tested by assays known to those skilled in th...
In DepthDetails US Patent
TargetCasein kinase II subunit alpha(Homo sapiens (Human))
Bristol-Myers Squibb
US Patent
LigandPNGBDBM142837(US8940736, 409)
Affinity DataIC50:  1.32nMpH: 7.4 T: 2°C. Assay description: The effectiveness of compounds of the present invention as inhibitors of protein kinases can be readily tested by assays known to those skilled in th...
In DepthDetails US Patent