BDBM143051 US9682141, 593
SMILES CN1CCN(CC1=O)C1CN(C1)c1cnc2ccc(nc2c1)-c1ccc2oc(N)nc2c1
InChI Key InChIKey=DAZOFBRNHMHULZ-UHFFFAOYSA-N
Data  5 IC50
  Tab Delimited (TSV)   2D SDfile   Computed 3D by Vconf -m prep SDfile
Find this compound or compounds like it in BindingDB:
Activity Spreadsheet -- Enzyme Inhibition Constant Data from BindingDB
Found 5 hits for monomerid = 143051
TargetSerine/threonine-protein kinase mTOR(Homo sapiens (Human))
Intellikine
US Patent
LigandPNGBDBM143051(US9682141, 593)
Affinity DataIC50: <1.00E+4nMT: 2°C. Assay description: The kinase reaction is performed in a white 384 well microtitre plate. The total reaction volume is 20 ul per well and the reaction buffer compositio...
Ligand InfoPC cidPC sid
In DepthDetails US Patent
TargetPhosphatidylinositol 3-kinase regulatory subunit alpha(Homo sapiens (Human))
Intellikine
US Patent
LigandPNGBDBM143051(US9682141, 593)
Affinity DataIC50: <100nMT: 2°C. Assay description: Briefly, the assay is a time resolved FRET assay that indirectly measures PIP3 product formed by the activity of a PI3-K. The kinase reaction is perf...
Ligand InfoPC cidPC sid
In DepthDetails US Patent
LigandPNGBDBM143051(US9682141, 593)
Affinity DataIC50: <100nMT: 2°C. Assay description: Briefly, the assay is a time resolved FRET assay that indirectly measures PIP3 product formed by the activity of a PI3-K. The kinase reaction is perf...
Ligand InfoPC cidPC sid
In DepthDetails US Patent
LigandPNGBDBM143051(US9682141, 593)
Affinity DataIC50: <1.00E+3nMT: 2°C. Assay description: Briefly, the assay is a time resolved FRET assay that indirectly measures PIP3 product formed by the activity of a PI3-K. The kinase reaction is perf...
Ligand InfoPC cidPC sid
In DepthDetails US Patent
TargetPhosphatidylinositol 3-kinase regulatory subunit beta(Homo sapiens (Human))
Intellikine
US Patent
LigandPNGBDBM143051(US9682141, 593)
Affinity DataIC50: <1.00E+4nMT: 2°C. Assay description: Briefly, the assay is a time resolved FRET assay that indirectly measures PIP3 product formed by the activity of a PI3-K. The kinase reaction is perf...
Ligand InfoPC cidPC sid
In DepthDetails US Patent