BDBM144343 US8969348, [4-(Naphthalen-1-ylmethyl)-1-oxophthalazin-2(1H)-yl](phenyl)acetic acid
SMILES OC(=O)C(c1ccccc1)n1nc(Cc2cccc3ccccc23)c2ccccc2c1=O
InChI Key InChIKey=VEJXCOIVBQLOOM-UHFFFAOYSA-N
Data  1 IC50
  Tab Delimited (TSV)   2D SDfile   Computed 3D by Vconf -m prep SDfile
Find this compound or compounds like it in BindingDB:
Activity Spreadsheet -- Enzyme Inhibition Constant Data from BindingDB
Found 1 hit for monomerid = 144343
TargetChymase(Homo sapiens (Human))
Boehringer Ingelheim International
US Patent
LigandPNGBDBM144343(US8969348, [4-(Naphthalen-1-ylmethyl)-1-oxophthala...)
Affinity DataIC50:  170nMpH: 8.0Assay Description:Chymase assays were performed in a total volume of 15 uL in Corning black opaque 384-well microtiter plates with a non-binding surface (Corning, N.Y....
In DepthDetails US Patent